{"text_format":"1","workbook":"xlsx","n_sheets":5,"sheets":["Performance Table","Performance Graphs","Index-based 7Twelve components","Calculations","Raw data"],"not_rendered":{"charts":2,"images":1,"macros":0,"external_links":0,"defined_names":2,"comments":0,"pivot_tables":0},"unopened":[],"bounds":{"document_bytes":16777216,"sheet_cells":100000,"rows_first":2000,"rows_last":500,"rows_between":2000,"halvings":0,"cell_chars":16384,"cell_head_chars":4096},"cells_cut":0,"cells_raw":0,"read":"whole","date_system":"1900"}

{"sheet":"Performance Table","index":0,"n_rows":67,"n_cols":21,"rows_kept":67,"cut":false,"hidden":false,"merged":[[1,1,1,6],[2,9,3,9]]}
[]
[null,"STEP 1:  Build Your Own Asset Allocation Model in Pink Cells",null,null,null,null,null,{"$f":"IF(H3<>1,\"ERROR\",\"\")","v":""},"7Twelve Portfolio ","STEP 2:"," Annual % Returns of 7Twelveand YOUR COMPARISON PORTFOLIO",null,null,null,null,null,null,null,null,"STEP 3:  Enter Retirement Portfolio Data in pink cells"]
[null,"Enter Your Allocations ->",0.25,0.1,0.15,0.35,0.15,{"$f":"SUM(C3:G3)","v":1},"www.7TwelvePortfolio.com","Enter a \"1\" below to include year, \"0\" to exclude year",null,"7Twelve performance with annual rebalancing"]
[null,"Asset Class Annual Returns","Large US Stock","Small US Stock","Non-US Stock","Bonds","Cash",null,"Data Period                                                              (Years selected must be contiguous)                                                No gaps in period being analyzed",null,"Index-based 7Twelve Portfolio","Active 7Twelve Portfolio","Passive 7Twelve Portfolio","Passive 7Twelve 20% Extra Cash","Passive 7Twelve 40% Extra Cash","Passive 7Twelve 60% Extra Cash",null,"Your Custom Portfolio",null,"Starting Balance in                           Retirement Account",100000]
[null,2001,-11.885820968682959,2.4862880253681885,-21.442765431811061,8.4434520133851443,3.3827868143328832,null,{"$f":"'Raw data'!A4","v":2001},1,{"$f":"+IF($J5=1,'Raw data'!C4,\"\")","v":-3.0901508118186407},{"$f":"+IF($J5=1,'Raw data'!D4,\"\")","v":1.977690420867674},{"$f":"+IF($J5=1,'Raw data'!E4,\"\")","v":-2.9412741822201558},{"$f":"+IF($J5=1,'Raw data'!F4,\"\")","v":-1.7200717913466874},{"$f":"+IF($J5=1,'Raw data'!G4,\"\")","v":-0.49886940047321959},{"$f":"+IF($J5=1,'Raw data'!H4,\"\")","v":0.72233299040024934},null,{"$f":"+IF($J5=1,'Raw data'!I4,\"\")","v":-3.4766150275708472},null,"Initial Withdrawal Rate (%)",0.04]
[null,{"$f":"B5+1","v":2002},-22.100445474225339,-20.483745048883016,-15.940080223253538,10.254970473271353,1.6022333608455064,null,{"$f":"'Raw data'!A5","v":2002},1,{"$f":"+IF($J6=1,'Raw data'!C5,\"\")","v":-1.5621481726756612},{"$f":"+IF($J6=1,'Raw data'!D5,\"\")","v":1.1798020548785382},{"$f":"+IF($J6=1,'Raw data'!E5,\"\")","v":-1.6362026854069178},{"$f":"+IF($J6=1,'Raw data'!F5,\"\")","v":-1.1789151491238847},{"$f":"+IF($J6=1,'Raw data'!G5,\"\")","v":-0.72162761284085153},{"$f":"+IF($J6=1,'Raw data'!H5,\"\")","v":-0.26434007655781822},null,{"$f":"+IF($J6=1,'Raw data'!I5,\"\")","v":-7.1349232371608684},null,"Annual Cost of Living Adjustment (%)",0.05]
[null,{"$f":"B6+1","v":2003},28.684531592648831,47.254154386835289,38.585902993957724,4.1045560723038221,1.0109494946501929,null,{"$f":"'Raw data'!A6","v":2003},1,{"$f":"+IF($J7=1,'Raw data'!C6,\"\")","v":26.097089253477911},{"$f":"+IF($J7=1,'Raw data'!D6,\"\")","v":27.81567102558299},{"$f":"+IF($J7=1,'Raw data'!E6,\"\")","v":25.952704967227902},{"$f":"+IF($J7=1,'Raw data'!F6,\"\")","v":20.741293439908183},{"$f":"+IF($J7=1,'Raw data'!G6,\"\")","v":15.529881912588472},{"$f":"+IF($J7=1,'Raw data'!H6,\"\")","v":10.318470385268753},null,{"$f":"+IF($J7=1,'Raw data'!I6,\"\")","v":18.272670835443261}]
[null,2004,10.882191634153848,18.329592030133025,20.247212383969693,4.3387920333667562,1.3707582182073352,null,{"$f":"'Raw data'!A7","v":2004},1,{"$f":"+IF($J8=1,'Raw data'!C7,\"\")","v":16.956984853175733},{"$f":"+IF($J8=1,'Raw data'!D7,\"\")","v":18.793519683419248},{"$f":"+IF($J8=1,'Raw data'!E7,\"\")","v":16.804466357593501},{"$f":"+IF($J8=1,'Raw data'!F7,\"\")","v":13.465157272793631},{"$f":"+IF($J8=1,'Raw data'!G7,\"\")","v":10.125848187993761},{"$f":"+IF($J8=1,'Raw data'!H7,\"\")","v":6.786539103193892},null,{"$f":"+IF($J8=1,'Raw data'!I7,\"\")","v":8.3147799135566842},null,"Year of Withdrawal","Withdrawal Amount"]
{"$rows_left_out":60}
{"sheet":"Performance Graphs","index":1,"n_rows":54,"n_cols":25,"rows_kept":54,"cut":false,"hidden":false,"merged":[]}
[]
[null,null,"      Accumulation Portfolio Analysis",null,null,null,null,null,null,null,null,null,null,null,null,null,"                  Distribution Portfolio Analysis","                  Distribution Portfolio Analysis"]
[null,null,"       Time Period ",null,null,{"$f":"'Performance Table'!$P$30","v":2001},"to",{"$f":"'Performance Table'!$R$30","v":2025},null,null,null,null,null,null,null,null,null,null,"Time Period ",{"$f":"'Performance Table'!$P$30","v":2001},"to",{"$f":"'Performance Table'!$R$30","v":2025}]
[]
[]
[]
[]
[]
{"$rows_left_out":47}
{"sheet":"Index-based 7Twelve components","index":2,"n_rows":16,"n_cols":3,"rows_kept":16,"cut":false,"hidden":false,"merged":[]}
[]
[null,"7Twelve Portfolio Model  (65% equities and diversifiers / 35% fixed income)"]
[]
[null,"Asset Class","Each index is equally weighted at 8.33% in the 7Twelve model"]
[null,"US Large cap","S&P 500 Index (TR)"]
[null,"US Mid Cap","S&P Midcap 400 Index (TR)"]
[null,"US Small Cap","S&P Small Cap 600 Index (TR)"]
[null,"Non-US Developed","MSCI EAFE Index NR USD"]
{"$rows_left_out":9}
{"sheet":"Calculations","index":3,"n_rows":59,"n_cols":41,"rows_kept":59,"cut":false,"hidden":true,"merged":[]}
[null,null,null,null,null,null,null,null,null,null,null,null,null,null,null,null,null,null,null,null,null,null,null,null,null,null,null,null,null,null,null,"Initial",{"$f":"'Performance Table'!U5","v":0.04}]
[null,null,null,null,null,"       Annual Returns",null,null,null,null,null,null,null,null,"Rolling 3-Year Returns",null,null,null,null,null,null,null,null,null,"Growth of $10,000",null,null,null,null,null,null,"COLA",{"$f":"'Performance Table'!U6","v":0.05},null,null,"Distribution Portfolio"]
["Year","Year Selector","Year Counter",{"$f":"'Performance Table'!K4","v":"Index-based 7Twelve Portfolio"},{"$f":"'Performance Table'!L4","v":"Active 7Twelve Portfolio"},{"$f":"'Performance Table'!M4","v":"Passive 7Twelve Portfolio"},{"$f":"'Performance Table'!N4","v":"Passive 7Twelve 20% Extra Cash"},{"$f":"'Performance Table'!O4","v":"Passive 7Twelve 40% Extra Cash"},{"$f":"'Performance Table'!P4","v":"Passive 7Twelve 60% Extra Cash"},{"$f":"'Performance Table'!R4","v":"Your Custom Portfolio"},null,null,"Year",{"$f":"+D3","v":"Index-based 7Twelve Portfolio"},"Active 7Twelve Portfolio","Passive 7Twelve Portfolio","Passive 7Twelve 20% Extra Cash","Passive 7Twelve 40% Extra Cash","Passive 7Twelve 60% Extra Cash","Your Custom Portfolio",null,null,null,{"$f":"+N3","v":"Index-based 7Twelve Portfolio"},"Active 7Twelve Portfolio","Passive 7Twelve Portfolio","Passive 7Twelve 20% Extra Cash","Passive 7Twelve 40% Extra Cash","Passive 7Twelve 60% Extra Cash","Your Custom Portfolio",null,"Starting Balance",{"$f":"'Performance Table'!U4","v":100000},"Annual Withdrawal",{"$f":"+X3","v":"Index-based 7Twelve Portfolio"},"Active 7Twelve Portfolio","Passive 7Twelve Portfolio","Passive 7Twelve 20% Extra Cash","Passive 7Twelve 40% Extra Cash","Passive 7Twelve 60% Extra Cash","Your Custom Portfolio"]
[]
[{"$f":"'Performance Table'!I5","v":2001},{"$f":"'Performance Table'!J5","v":1},{"$f":"IF('Performance Table'!J5<0,0,IF('Performance Table'!J5=0,0,IF('Performance Table'!J5=1,1,IF('Performance Table'!J5>1,0))))","v":1},{"$f":"+IF('Performance Table'!$J5=1,'Performance Table'!K5/100+1,\"\")","v":0.96909849188181363},{"$f":"+IF('Performance Table'!$J5=1,'Performance Table'!L5/100+1,\"\")","v":1.0197769042086768},{"$f":"+IF('Performance Table'!$J5=1,'Performance Table'!M5/100+1,\"\")","v":0.97058725817779845},{"$f":"+IF('Performance Table'!$J5=1,'Performance Table'!N5/100+1,\"\")","v":0.98279928208653311},{"$f":"+IF('Performance Table'!$J5=1,'Performance Table'!O5/100+1,\"\")","v":0.99501130599526777},{"$f":"+IF('Performance Table'!$J5=1,'Performance Table'!P5/100+1,\"\")","v":1.0072233299040025},{"$f":"+IF('Performance Table'!$J5=1,'Performance Table'!R5/100+1,\"\")","v":0.96523384972429149},null,null,{"$f":"+IF(B5=1,A5,IF(B5<>1,\"--\",\"--\"))","v":2001},{"$f":"+IF(SUM($C5:$C5)=3,PRODUCT(Calculations!D5:D5)-1,\"\")","v":""},{"$f":"+IF(SUM($C5:$C5)=3,PRODUCT(Calculations!E5:E5)-1,\"\")","v":""},{"$f":"+IF(SUM($C5:$C5)=3,PRODUCT(Calculations!F5:F5)-1,\"\")","v":""},{"$f":"+IF(SUM($C5:$C5)=3,PRODUCT(Calculations!G5:G5)-1,\"\")","v":""},{"$f":"+IF(SUM($C5:$C5)=3,PRODUCT(Calculations!H5:H5)-1,\"\")","v":""},{"$f":"+IF(SUM($C5:$C5)=3,PRODUCT(Calculations!I5:I5)-1,\"\")","v":""},{"$f":"+IF(SUM($C5:$C5)=3,PRODUCT(Calculations!J5:J5)-1,\"\")","v":""},null,null,null,{"$f":"+IF('Performance Table'!$J5=1,10000*Calculations!D5,\"--\")","v":9690.9849188181361},{"$f":"+IF('Performance Table'!$J5=1,10000*Calculations!E5,\"--\")","v":10197.769042086768},{"$f":"+IF('Performance Table'!$J5=1,10000*Calculations!F5,\"--\")","v":9705.872581777985},{"$f":"+IF('Performance Table'!$J5=1,10000*Calculations!G5,\"--\")","v":9827.9928208653309},{"$f":"+IF('Performance Table'!$J5=1,10000*Calculations!H5,\"--\")","v":9950.1130599526768},{"$f":"+IF('Performance Table'!$J5=1,10000*Calculations!I5,\"--\")","v":10072.233299040025},{"$f":"+IF('Performance Table'!$J5=1,10000*Calculations!J5,\"--\")","v":9652.3384972429158},null,null,null,{"$f":"+IF('Performance Table'!$J5=1,AG3*AG1,\"--\")","v":4000},{"$f":"+IF('Performance Table'!$J5=1,($AG3*D5)-$AH5,\"--\")","v":92909.849188181368},{"$f":"+IF('Performance Table'!$J5=1,($AG3*E5)-$AH5,\"--\")","v":97977.690420867686},{"$f":"+IF('Performance Table'!$J5=1,($AG3*F5)-$AH5,\"--\")","v":93058.72581777985},{"$f":"+IF('Performance Table'!$J5=1,($AG3*G5)-$AH5,\"--\")","v":94279.928208653306},{"$f":"+IF('Performance Table'!$J5=1,($AG3*H5)-$AH5,\"--\")","v":95501.130599526776},{"$f":"+IF('Performance Table'!$J5=1,($AG3*I5)-$AH5,\"--\")","v":96722.33299040026},{"$f":"+IF('Performance Table'!$J5=1,($AG3*J5)-$AH5,\"--\")","v":92523.38497242915}]
[{"$f":"'Performance Table'!I6","v":2002},{"$f":"'Performance Table'!J6","v":1},{"$f":"IF('Performance Table'!J6<0,0,IF('Performance Table'!J6=0,0,IF('Performance Table'!J6=1,1,IF('Performance Table'!J6>1,0))))","v":1},{"$f":"+IF('Performance Table'!$J6=1,'Performance Table'!K6/100+1,\"\")","v":0.98437851827324341},{"$f":"+IF('Performance Table'!$J6=1,'Performance Table'!L6/100+1,\"\")","v":1.0117980205487853},{"$f":"+IF('Performance Table'!$J6=1,'Performance Table'!M6/100+1,\"\")","v":0.98363797314593082},{"$f":"+IF('Performance Table'!$J6=1,'Performance Table'!N6/100+1,\"\")","v":0.98821084850876117},{"$f":"+IF('Performance Table'!$J6=1,'Performance Table'!O6/100+1,\"\")","v":0.99278372387159153},{"$f":"+IF('Performance Table'!$J6=1,'Performance Table'!P6/100+1,\"\")","v":0.99735659923442177},{"$f":"+IF('Performance Table'!$J6=1,'Performance Table'!R6/100+1,\"\")","v":0.92865076762839127},null,null,{"$f":"+IF(B6=1,A6,IF(B6<>1,\"--\",\"--\"))","v":2002},null,null,null,null,null,null,null,null,null,null,{"$f":"+IF('Performance Table'!$J5+'Performance Table'!$J6=2,X5*Calculations!D6,IF('Performance Table'!$J6=1,10000*D6,\"--\"))","v":9539.5973749945442},{"$f":"+IF('Performance Table'!$J5+'Performance Table'!$J6=2,Y5*Calculations!E6,IF('Performance Table'!$J6=1,10000*E6,\"--\"))","v":10318.082530797074},{"$f":"+IF('Performance Table'!$J5+'Performance Table'!$J6=2,Z5*Calculations!F6,IF('Performance Table'!$J6=1,10000*F6,\"--\"))","v":9547.0648339527597},{"$f":"+IF('Performance Table'!$J5+'Performance Table'!$J6=2,AA5*Calculations!G6,IF('Performance Table'!$J6=1,10000*G6,\"--\"))","v":9712.129124645342},{"$f":"+IF('Performance Table'!$J5+'Performance Table'!$J6=2,AB5*Calculations!H6,IF('Performance Table'!$J6=1,10000*H6,\"--\"))","v":9878.3102966031747},{"$f":"+IF('Performance Table'!$J5+'Performance Table'!$J6=2,AC5*Calculations!I6,IF('Performance Table'!$J6=1,10000*I6,\"--\"))","v":10045.60834982626},{"$f":"+IF('Performance Table'!$J5+'Performance Table'!$J6=2,AD5*Calculations!J6,IF('Performance Table'!$J6=1,10000*J6,\"--\"))","v":8963.6515548737061},null,null,null,{"$f":"+IF('Performance Table'!$J5+'Performance Table'!$J6=2,AH5*(1+AG$2),IF('Performance Table'!$J6=1,AG$3*AG$1,\"--\"))","v":4200},{"$f":"+IF('Performance Table'!$J5+'Performance Table'!$J6=2,(AI5*D6)-$AH6,IF('Performance Table'!$J6=1,($AG$3*D6)-$AH6,\"--\"))","v":87258.459676852479},{"$f":"+IF('Performance Table'!$J5+'Performance Table'!$J6=2,(AJ5*E6)-$AH6,IF('Performance Table'!$J6=1,($AG$3*E6)-$AH6,\"--\"))","v":94933.633225775615},{"$f":"+IF('Performance Table'!$J5+'Performance Table'!$J6=2,(AK5*F6)-$AH6,IF('Performance Table'!$J6=1,($AG$3*F6)-$AH6,\"--\"))","v":87336.096446943877},{"$f":"+IF('Performance Table'!$J5+'Performance Table'!$J6=2,(AL5*G6)-$AH6,IF('Performance Table'!$J6=1,($AG$3*G6)-$AH6,\"--\"))","v":88968.447852418365},{"$f":"+IF('Performance Table'!$J5+'Performance Table'!$J6=2,(AM5*H6)-$AH6,IF('Performance Table'!$J6=1,($AG$3*H6)-$AH6,\"--\"))","v":90611.968070545394},{"$f":"+IF('Performance Table'!$J5+'Performance Table'!$J6=2,(AN5*I6)-$AH6,IF('Performance Table'!$J6=1,($AG$3*I6)-$AH6,\"--\"))","v":92266.657101324919},{"$f":"+IF('Performance Table'!$J5+'Performance Table'!$J6=2,(AO5*J6)-$AH6,IF('Performance Table'!$J6=1,($AG$3*J6)-$AH6,\"--\"))","v":81721.912478223487}]
[{"$f":"'Performance Table'!I7","v":2003},{"$f":"'Performance Table'!J7","v":1},{"$f":"IF('Performance Table'!J7<0,0,IF('Performance Table'!J7=0,0,IF('Performance Table'!J7=1,1,IF('Performance Table'!J7>1,0))))","v":1},{"$f":"+IF('Performance Table'!$J7=1,'Performance Table'!K7/100+1,\"\")","v":1.2609708925347791},{"$f":"+IF('Performance Table'!$J7=1,'Performance Table'!L7/100+1,\"\")","v":1.2781567102558298},{"$f":"+IF('Performance Table'!$J7=1,'Performance Table'!M7/100+1,\"\")","v":1.259527049672279},{"$f":"+IF('Performance Table'!$J7=1,'Performance Table'!N7/100+1,\"\")","v":1.2074129343990818},{"$f":"+IF('Performance Table'!$J7=1,'Performance Table'!O7/100+1,\"\")","v":1.1552988191258846},{"$f":"+IF('Performance Table'!$J7=1,'Performance Table'!P7/100+1,\"\")","v":1.1031847038526876},{"$f":"+IF('Performance Table'!$J7=1,'Performance Table'!R7/100+1,\"\")","v":1.1827267083544326},null,null,2003,{"$f":"+IF(SUM($C5:$C7)=3,PRODUCT(Calculations!D5:D7)-1,\"\")","v":0.20291546163693064},{"$f":"+IF(SUM($C5:$C7)=3,PRODUCT(Calculations!E5:E7)-1,\"\")","v":0.31881264237117346},{"$f":"+IF(SUM($C5:$C7)=3,PRODUCT(Calculations!F5:F7)-1,\"\")","v":0.20247864033384855},{"$f":"+IF(SUM($C5:$C7)=3,PRODUCT(Calculations!G5:G7)-1,\"\")","v":0.17265503256508197},{"$f":"+IF(SUM($C5:$C7)=3,PRODUCT(Calculations!H5:H7)-1,\"\")","v":0.14124002206247166},{"$f":"+IF(SUM($C5:$C7)=3,PRODUCT(Calculations!I5:I7)-1,\"\")","v":0.10821614724231687},{"$f":"+IF(SUM($C5:$C7)=3,PRODUCT(Calculations!J5:J7)-1,\"\")","v":6.0155009833187112E-2},null,null,null,{"$f":"+IF('Performance Table'!$J6+'Performance Table'!$J7=2,X6*Calculations!D7,IF('Performance Table'!$J7=1,10000*D7,\"--\"))","v":12029.154616369306},{"$f":"+IF('Performance Table'!$J6+'Performance Table'!$J7=2,Y6*Calculations!E7,IF('Performance Table'!$J7=1,10000*E7,\"--\"))","v":13188.126423711734},{"$f":"+IF('Performance Table'!$J6+'Performance Table'!$J7=2,Z6*Calculations!F7,IF('Performance Table'!$J7=1,10000*F7,\"--\"))","v":12024.786403338487},{"$f":"+IF('Performance Table'!$J6+'Performance Table'!$J7=2,AA6*Calculations!G7,IF('Performance Table'!$J7=1,10000*G7,\"--\"))","v":11726.550325650818},{"$f":"+IF('Performance Table'!$J6+'Performance Table'!$J7=2,AB6*Calculations!H7,IF('Performance Table'!$J7=1,10000*H7,\"--\"))","v":11412.400220624715},{"$f":"+IF('Performance Table'!$J6+'Performance Table'!$J7=2,AC6*Calculations!I7,IF('Performance Table'!$J7=1,10000*I7,\"--\"))","v":11082.161472423168},{"$f":"+IF('Performance Table'!$J6+'Performance Table'!$J7=2,AD6*Calculations!J7,IF('Performance Table'!$J7=1,10000*J7,\"--\"))","v":10601.550098331871},null,null,null,{"$f":"+IF('Performance Table'!$J6+'Performance Table'!$J7=2,AH6*(1+AG$2),IF('Performance Table'!$J7=1,AG$3*AG$1,\"--\"))","v":4410},{"$f":"+IF('Performance Table'!$J6+'Performance Table'!$J7=2,(AI6*D7)-$AH7,IF('Performance Table'!$J7=1,($AG$3*D7)-$AH7,\"--\"))","v":105620.3777799307},{"$f":"+IF('Performance Table'!$J6+'Performance Table'!$J7=2,(AJ6*E7)-$AH7,IF('Performance Table'!$J7=1,($AG$3*E7)-$AH7,\"--\"))","v":116930.0603364909},{"$f":"+IF('Performance Table'!$J6+'Performance Table'!$J7=2,(AK6*F7)-$AH7,IF('Performance Table'!$J7=1,($AG$3*F7)-$AH7,\"--\"))","v":105592.17588771283},{"$f":"+IF('Performance Table'!$J6+'Performance Table'!$J7=2,(AL6*G7)-$AH7,IF('Performance Table'!$J7=1,($AG$3*G7)-$AH7,\"--\"))","v":103011.65469042015},{"$f":"+IF('Performance Table'!$J6+'Performance Table'!$J7=2,(AM6*H7)-$AH7,IF('Performance Table'!$J7=1,($AG$3*H7)-$AH7,\"--\"))","v":100273.89971057346},{"$f":"+IF('Performance Table'!$J6+'Performance Table'!$J7=2,(AN6*I7)-$AH7,IF('Performance Table'!$J7=1,($AG$3*I7)-$AH7,\"--\"))","v":97377.164789802613},{"$f":"+IF('Performance Table'!$J6+'Performance Table'!$J7=2,(AO6*J7)-$AH7,IF('Performance Table'!$J7=1,($AG$3*J7)-$AH7,\"--\"))","v":92244.688545798301}]
[{"$f":"'Performance Table'!I8","v":2004},{"$f":"'Performance Table'!J8","v":1},{"$f":"IF('Performance Table'!J8<0,0,IF('Performance Table'!J8=0,0,IF('Performance Table'!J8=1,1,IF('Performance Table'!J8>1,0))))","v":1},{"$f":"+IF('Performance Table'!$J8=1,'Performance Table'!K8/100+1,\"\")","v":1.1695698485317574},{"$f":"+IF('Performance Table'!$J8=1,'Performance Table'!L8/100+1,\"\")","v":1.1879351968341925},{"$f":"+IF('Performance Table'!$J8=1,'Performance Table'!M8/100+1,\"\")","v":1.1680446635759349},{"$f":"+IF('Performance Table'!$J8=1,'Performance Table'!N8/100+1,\"\")","v":1.1346515727279363},{"$f":"+IF('Performance Table'!$J8=1,'Performance Table'!O8/100+1,\"\")","v":1.1012584818799376},{"$f":"+IF('Performance Table'!$J8=1,'Performance Table'!P8/100+1,\"\")","v":1.0678653910319389},{"$f":"+IF('Performance Table'!$J8=1,'Performance Table'!R8/100+1,\"\")","v":1.0831477991355669},null,null,2004,{"$f":"+IF(SUM($C6:$C8)=3,PRODUCT(Calculations!D6:D8)-1,\"\")","v":0.45175507551485472},{"$f":"+IF(SUM($C6:$C8)=3,PRODUCT(Calculations!E6:E8)-1,\"\")","v":0.53628107229817723},{"$f":"+IF(SUM($C6:$C8)=3,PRODUCT(Calculations!F6:F8)-1,\"\")","v":0.44711229935464836},{"$f":"+IF(SUM($C6:$C8)=3,PRODUCT(Calculations!G6:G8)-1,\"\")","v":0.35384193010648457},{"$f":"+IF(SUM($C6:$C8)=3,PRODUCT(Calculations!H6:H8)-1,\"\")","v":0.26310148094249008},{"$f":"+IF(SUM($C6:$C8)=3,PRODUCT(Calculations!I6:I8)-1,\"\")","v":0.17493869957878827},{"$f":"+IF(SUM($C6:$C8)=3,PRODUCT(Calculations!J6:J8)-1,\"\")","v":0.18966462476565904},null,null,null,{"$f":"+IF('Performance Table'!$J7+'Performance Table'!$J8=2,X7*Calculations!D8,IF('Performance Table'!$J8=1,10000*D8,\"--\"))","v":14068.936542632138},{"$f":"+IF('Performance Table'!$J7+'Performance Table'!$J8=2,Y7*Calculations!E8,IF('Performance Table'!$J8=1,10000*E8,\"--\"))","v":15666.639559026213},{"$f":"+IF('Performance Table'!$J7+'Performance Table'!$J8=2,Z7*Calculations!F8,IF('Performance Table'!$J8=1,10000*F8,\"--\"))","v":14045.48758905998},{"$f":"+IF('Performance Table'!$J7+'Performance Table'!$J8=2,AA7*Calculations!G8,IF('Performance Table'!$J8=1,10000*G8,\"--\"))","v":13305.548769672994},{"$f":"+IF('Performance Table'!$J7+'Performance Table'!$J8=2,AB7*Calculations!H8,IF('Performance Table'!$J8=1,10000*H8,\"--\"))","v":12568.002541571439},{"$f":"+IF('Performance Table'!$J7+'Performance Table'!$J8=2,AC7*Calculations!I8,IF('Performance Table'!$J8=1,10000*I8,\"--\"))","v":11834.256694228254},{"$f":"+IF('Performance Table'!$J7+'Performance Table'!$J8=2,AD7*Calculations!J8,IF('Performance Table'!$J8=1,10000*J8,\"--\"))","v":11483.045656433618},null,null,null,{"$f":"+IF('Performance Table'!$J7+'Performance Table'!$J8=2,AH7*(1+AG$2),IF('Performance Table'!$J8=1,AG$3*AG$1,\"--\"))","v":4630.5},{"$f":"+IF('Performance Table'!$J7+'Performance Table'!$J8=2,(AI7*D8)-$AH8,IF('Performance Table'!$J8=1,($AG$3*D8)-$AH8,\"--\"))","v":118899.90924194054},{"$f":"+IF('Performance Table'!$J7+'Performance Table'!$J8=2,(AJ7*E8)-$AH8,IF('Performance Table'!$J8=1,($AG$3*E8)-$AH8,\"--\"))","v":134274.83424166331},{"$f":"+IF('Performance Table'!$J7+'Performance Table'!$J8=2,(AK7*F8)-$AH8,IF('Performance Table'!$J8=1,($AG$3*F8)-$AH8,\"--\"))","v":118705.87756101448},{"$f":"+IF('Performance Table'!$J7+'Performance Table'!$J8=2,(AL7*G8)-$AH8,IF('Performance Table'!$J8=1,($AG$3*G8)-$AH8,\"--\"))","v":112251.83600379231},{"$f":"+IF('Performance Table'!$J7+'Performance Table'!$J8=2,(AM7*H8)-$AH8,IF('Performance Table'!$J8=1,($AG$3*H8)-$AH8,\"--\"))","v":105796.98256744724},{"$f":"+IF('Performance Table'!$J7+'Performance Table'!$J8=2,(AN7*I8)-$AH8,IF('Performance Table'!$J8=1,($AG$3*I8)-$AH8,\"--\"))","v":99355.204155844112},{"$f":"+IF('Performance Table'!$J7+'Performance Table'!$J8=2,(AO7*J8)-$AH8,IF('Performance Table'!$J8=1,($AG$3*J8)-$AH8,\"--\"))","v":95284.131380327264}]
{"$rows_left_out":52}
{"sheet":"Raw data","index":4,"n_rows":57,"n_cols":16,"rows_kept":57,"cut":false,"hidden":true,"merged":[]}
[]
[null,null,null,"  Annual % Returns (with Annual Rebalancing)"]
[null,null,{"$f":"'Performance Table'!K4","v":"Index-based 7Twelve Portfolio"},{"$f":"'Performance Table'!L4","v":"Active 7Twelve Portfolio"},{"$f":"'Performance Table'!M4","v":"Passive 7Twelve Portfolio"},{"$f":"'Performance Table'!N4","v":"Passive 7Twelve 20% Extra Cash"},{"$f":"'Performance Table'!O4","v":"Passive 7Twelve 40% Extra Cash"},{"$f":"'Performance Table'!P4","v":"Passive 7Twelve 60% Extra Cash"},{"$f":"'Performance Table'!R4","v":"Your Custom Portfolio"},null,null,{"$f":"'Performance Table'!C4","v":"Large US Stock"},{"$f":"'Performance Table'!D4","v":"Small US Stock"},{"$f":"'Performance Table'!E4","v":"Non-US Stock"},{"$f":"'Performance Table'!F4","v":"Bonds"},{"$f":"'Performance Table'!G4","v":"Cash"}]
[{"$f":"+A33","v":2001},null,{"$f":"+C33-C$30","v":-3.0901508118186407},{"$f":"+D33-D$30","v":1.977690420867674},{"$f":"+E33-E$30","v":-2.9412741822201558},-1.7200717913466874,-0.49886940047321959,0.72233299040024934,{"$f":"SUMPRODUCT('Performance Table'!C$3:G$3,'Performance Table'!C5:G5)-H$30","v":-3.4766150275708472}]
[2002,null,{"$f":"+C34-C$30","v":-1.5621481726756612},{"$f":"+D34-D$30","v":1.1798020548785382},{"$f":"+E34-E$30","v":-1.6362026854069178},-1.1789151491238847,-0.72162761284085153,-0.26434007655781822,{"$f":"SUMPRODUCT('Performance Table'!C$3:G$3,'Performance Table'!C6:G6)-H$30","v":-7.1349232371608684}]
[2003,null,{"$f":"+C35-C$30","v":26.097089253477911},{"$f":"+D35-D$30","v":27.81567102558299},25.952704967227902,20.741293439908183,15.529881912588472,10.318470385268753,{"$f":"SUMPRODUCT('Performance Table'!C$3:G$3,'Performance Table'!C7:G7)-H$30","v":18.272670835443261}]
[2004,null,{"$f":"+C36-C$30","v":16.956984853175733},{"$f":"+D36-D$30","v":18.793519683419248},16.804466357593501,13.465157272793631,10.125848187993761,6.786539103193892,{"$f":"SUMPRODUCT('Performance Table'!C$3:G$3,'Performance Table'!C8:G8)-H$30","v":8.3147799135566842}]
[{"$f":"+A37","v":2005},null,{"$f":"+C37-C$30","v":11.48562195286252},{"$f":"+D37-D$30","v":11.906900303873186},11.34355801026665,9.4765978057777733,7.6096376012888935,5.7426773968000164,{"$f":"SUMPRODUCT('Performance Table'!C$3:G$3,'Performance Table'!C9:G9)-H$30","v":4.035367833433515}]
{"$rows_left_out":49}